﻿Email,Phone,Date,Reason,"First Name","Last Name",Organization,Organization/Company,"Address Line 1","Address Line 2",City,State/Region,Country,"Zip Code","Text Consent","Customer Since",Comments/Questions
agathers57@gmail.com,803-479-0169,"2019-10-02 07:38:27",donotwant,Anita,Gathers,,,,,,,,,,1899-12-31,
anesha.brown5@gmail.com,,"2019-10-02 12:12:12",donotwant,Anesha,,,,,,,,,,,,
angiesavemore40@gmail.com,,"2019-10-02 07:22:11",donotwant,Angela,Parker,,,,,,,,,,1899-12-31,
bonnie.geiger@gmail.com,,"2019-10-02 09:44:52",,Bonnie,Geiger,,,,,,,,,,1899-12-31,
cgreene1304@gmail.com,,"2019-10-02 08:47:37",donotwant,Carla,Greene,,,,,,,,,,1899-12-31,
dcall555@gmail.com,4806992831,"2019-10-09 23:45:08",donotwant,Dawn,Callahan,,," 12966 E Wethersfield Rd",," Scottsdale"," AZ"," United States",85259,,1899-12-31,
decision9811@yahoo.com,803-290-4839,"2019-10-02 05:05:32",,Carolyn,Haynes,,,,,,,,,,1899-12-31,
emilyandtyree@yahoo.com,,"2019-10-01 21:16:58",noperm,Emily,Murphy,,,,,,,,,,1899-12-31,
gsrtinc@gmail.com,,"2019-10-01 21:02:09",noperm,Gabriel,Schofield,,,,,,,,,,1899-12-31,
hazelwilliams0345@comcast.net,,"2019-10-02 05:35:09",donotwant,Hazel,Williams,,,,,,,,,,,
hrs482@gmail.com,,"2019-10-08 10:03:25",donotwant,Hope,Williams,,,,,,,,,,1899-12-31,
jamaritrayvonsmith@gmail.com,,"2019-10-01 21:09:22",,Gloris,Smith,,,,,,,,,,1899-12-31,
jandink@aol.com,,"2019-10-04 06:54:54",,Janice,Dinkins,,,,,,,,,,,
kmckenzie@fsd2.org,843-598-2017,"2019-10-02 08:04:40",donotwant,Kwanna,McKenzie,,,,,,,,,,1899-12-31,
lievsay.casey@gmail.com,,"2019-10-01 22:31:16",donotwant,Casey,Garrett,,,,,,,,,,1899-12-31,
megstew389@yahoo.com,,"2019-10-01 22:32:18",,Ms.,Meggan,,,,,,,,,,1899-12-31,
michelejones510@gmail.com,,"2019-10-01 21:21:02",donotwant,Michele,Jones,,,,,,,,,,1899-12-31,
myleeharris@aol.com,,"2019-10-01 22:00:21",,Melody,Harris,,,,,,,,,,,
nikpru5@yahoo.com,,"2019-10-10 15:06:05",donotwant,Nikki,Prude,,,,,,,,,,1899-12-31,
oleayland@yahoo.com,803-865-3243,"2019-10-02 16:59:47",donotwant,Sharon,Lacewell,,,,,,,,,,1899-12-31,
slsdws1@gmail.com,,"2019-10-01 21:01:25",donotwant,Sarah,Shafer,,,,,,,,,,1899-12-31,
sstope45@gmail.com,9412179880,"2019-10-01 21:02:44",,Scott,Tope,,," 11544 Echo Lake Circle"," Unit 105"," Bradenton"," FL"," United States",34211,,1899-12-31,
tnicolem51170@yahoo.com,,"2019-10-01 21:02:35",donotwant,Tory,McClaine,,,,,,,,,,1899-12-31,
